NATURAL HAZARDS
type: Concept

FAMINE
change note: 2012-07-02 08:44:19.0 [tbs1979] update Definition (Widespread scarcity of food caused by several factors including crop failure, overpopulation, or government policies. This phenomenon is usually accompanied or followed by regional malnutrition, starvation, epidemic, and increased mortality.);
change note: 2012-07-02 08:43:15.0 [tbs1979] insert Definition (id: null text: Widespread scarcity of food caused by several factors including crop failure, overpopulation, or government policies. This phenomenon is usually accompanied or followed by regional malnutrition, starvation, epidemic, and increased mortality language code: en);
change note: 2012-06-27 14:22:11.0 [tbs1979] Insert Concept add broader relation (FAMINE [6bb02b3d-be70-47b0-93d7-eb0c926f5979,40223] - NATURAL HAZARDS [ec0e2762-f57a-4fdc-b395-c8d7d5590d18,21253]);
in scheme: sciencekeywords
definition: Widespread scarcity of food caused by several factors including crop failure, overpopulation, or government policies. This phenomenon is usually accompanied or followed by regional malnutrition, starvation, epidemic, and increased mortality.
type: Concept