JP/GSI/GOC
change note: 2016-08-15 20:58:29.0 [saritz] insert Definition (id: null text: The Geospatial Information Authority of Japan (GSI) is the only national organization that conducts basic survey and mapping and instructs related organizations to clarify the conditions of land in Japan and that provides the results of surveys to help improve this land. language code: en);
change note: 2016-08-15 20:57:23.0 [saritz] insert AltLabel (id: null text: Geodetic Observation Center, Geospatial Information Authority, Japan language code: en);
change note: 2016-08-15 20:56:08.0 [saritz] Insert Concept add broader relation (JP/GSI/GOC [6be4c9cf-6bd9-439b-a793-781f950eebf6,277819] - JAPAN [f5d1252b-e0cd-4c19-9c43-69c7ea65e14d,249067]);
type: Concept
definition: The Geospatial Information Authority of Japan (GSI) is the only national organization that conducts basic survey and mapping and instructs related organizations to clarify the conditions of land in Japan and that provides the results of surveys to help improve this land.
in scheme: providers

JAPAN
type: Concept