Gemini
type: Concept

GEMINI-6
change note: 2021-11-30 12:23:04.0 [tstevens] Move Concepts delete broader relation (null); add broader relation (GEMINI-6 [6c0aee1a-955d-48c1-acc0-f7d095030308,826340] - GEMINI [443bd29e-d615-498d-8580-300249cb7695,826194]);
change note: 2021-11-30 12:20:54.0 [tstevens] Move Concepts delete broader relation (null); add broader relation (GEMINI-6 [6c0aee1a-955d-48c1-acc0-f7d095030308,826340] - Space Stations/Crewed Spacecraft [388e72a1-b851-4b78-9e69-747e06ae215f,826132]);
change note: 2021-11-30 12:15:50.0 [tstevens] Move Concepts delete broader relation (null); add broader relation (GEMINI-6 [6c0aee1a-955d-48c1-acc0-f7d095030308,826340] - Solar/Space Observation Satellites [8e8b7689-0a8e-47a4-9c68-5f6a207104d5,826501]);
change note: 2021-11-30 09:55:53.0 [tstevens] Move Concepts delete broader relation (null); add broader relation (GEMINI-6 [6c0aee1a-955d-48c1-acc0-f7d095030308,826340] - Space-based Platforms [b39a69b4-c3b9-4a94-b296-bbbbe5e4c847,835875]);
in scheme: platforms
definition: - Spacecraft Brief Description - GEMINI 6 was the fifth manned earth-orbiting spacecraft of the GEMINI series, having been launched after GEMINI 7. the mission priorities were to demonstrate on-time launch procedures, closed-loop rendezvous capabilities, and stationkeeping techniques with GEMINI 7. the crew conducted three scientific experiments -- (1) synoptic terrain photography, (2) synoptic weather photography, and (3) dim light photography. The mission was successfully completed after 25 hours of flight. The spacecraft landed within 11 km of the target point on December 16, 1965. - Auxiliary Information - Launch Date and Time : 1965-12-15 13:40:00 Epoch Date and Time : 1965-12-15 Apogee (km or AU): 271. Perigee (km or AU): 258. Inclination (degree) : 28.89 Orbit Type : Geocentric Additional information available at "http://science.ksc.nasa.gov/history/gemini/gemini-vi-a/gemini-vi-a.html"
type: Concept