PRECIPITATION
change note: 2021-08-30 09:42:28.0 [tstevens] insert Definition (id: null text: All liquid or solid phase aqueous particles that originate in the atmosphere and fall to the earth's surface. language code: en);
change note: 2020-08-25 17:28:59.0 [sritz] Insert Concept add broader relation (PRECIPITATION [6c71e621-aae6-436b-9405-5dc6ed2a527e,560651] - OCEAN VOLUME BUDGET [54b47174-d035-4b9c-99a5-27b39c7f0f17,560643]);
in scheme: sciencekeywords
definition: All liquid or solid phase aqueous particles that originate in the atmosphere and fall to the earth's surface.
type: Concept

OCEAN VOLUME BUDGET
type: Concept