APRON REEF
change note: 2013-08-20 08:45:48.0 [tbs1979] insert Definition (id: null text: A short reef resembling a fringing reef, but more sloped; extending out and downward from a point or peninsular shore. language code: en);
change note: 2013-08-06 08:10:18.0 [tbs1979] Insert Concept add broader relation (APRON REEF [6c78ed6a-2dbc-4ced-acc2-d0246e0afedd,105495] - CORAL REEFS [c6244bfb-300f-4818-bf45-cf1a15e7e073,105487]);
in scheme: sciencekeywords
definition: A short reef resembling a fringing reef, but more sloped; extending out and downward from a point or peninsular shore.
type: Concept

CORAL REEFS
type: Concept