PENNSTATE/EMS/GEOSCI
in scheme: providers
definition: The department of Geosciences at Penn State University conducts investigations in the chemistry and physics of rocks and minerals, the why's of earthquakes, faults, volcanoes, and ground movement, the nature of sediments old and new with their fossil record of life, the character of economically important geological materials, the processes associated with water and ice, and the cycling of elements through the earth system. In the field, they combine detailed mapping and observations with sampling and measurements; in the laboratory, they use sophisticated analytical and experimental techniques to examine the microstructure and chemistry of their samples; and at the computer, they assemble their data and create mathematical models to test their ideas. Specific research areas include: Aqueous Geochemistry Ice and Climate Research Environmental Molecular Science SEC(Seal Evaluation Consortium) Geophysics Geodynamics Sedimentary Geology Basin Research Physical Sedimentology Petroleum GeoSystems Program Structure/Tectonics Chemistry and Physics of Rocks and Minerals Earth Surface Systems Hydrosciences Paleobiology Global Changes and Earth History Solid Earth and Applied Geophysics Biogeochemistry Physical Processes Petroleum Society Website: "http://www.geosc.psu.edu/" [Summary provided by Penn State University
type: Concept

ACADEMIC
type: Concept