KETTLE HOLES
change note: 2013-04-01 10:14:30.0 [tbs1979] insert Definition (id: null text: A shallow, sediment-filled body of water formed by retreating glaciers or draining floodwaters. language code: en);
change note: 2013-03-05 08:31:49.0 [tbs1979] Insert Concept add broader relation (KETTLE HOLES [6d3722bb-29c0-4fb6-90c3-3f3a144b9941,82757] - GLACIAL LANDFORMS [3c78951a-0293-4fb0-baff-ec7372fe784d,64133]);
in scheme: sciencekeywords
definition: A shallow, sediment-filled body of water formed by retreating glaciers or draining floodwaters.
type: Concept

GLACIAL LANDFORMS
type: Concept