EPA/NE/LISO
in scheme: providers
definition: The Long Island Sound Study (LISS) is a cooperative effort involving researchers, regulators, user groups and other concerned organizations and individuals. These people are working together to protect and improve the health of the Sound by implementing the Sound's Comprehensive Conservation and Management Plan completed in 1994. Website: "http://www.epa.gov/region01/eco/lis/index.htm" [Summary provided by the EPA.]
type: Concept

EPA
type: Concept