COMMERCIAL
type: Concept

AXYS
in scheme: providers
definition: AXYS Environmental Consulting Ltd. is a multi-disciplinary consulting firm providing environmental services since 1974. Our professional and technical staff offers a wide range of expertise to a diverse clientele. Over the years we have consistently provided a comprehensive scientific approach to achieving practical, balanced solutions. Since it's establishment, AXYS has become a leading environmental consulting company, working nationally and internationally. Our staff of over 100 employees includes professional and technical scientists and administrative personnel. The firm provides consulting services in both the private and public sectors including customers in the oil and gas industry, recreation and tourism, agriculture, mining, provincial and federal governments and First Nations. Our strategically located offices in Calgary AB, Sidney BC, Inuvik NT and Winnipeg, MB provide consulting services in environmental impact assessments, soils assessments, geomatics, land use planning, marine biology, linear planning and Agronomics. We believe our combined experiences and skills coupled with our dedication to using science-based assessments to find balanced solutions is what establishes AXYS as an influential environmental consulting company. Website: "http://www.axys.net/" [Summary provided by AXYS Environmental Consulting Ltd.]
type: Concept