SOS/ALLIANCE
in scheme: providers
definition: The Southern Oxidants Study (SOS) is a strategic alliance of research scientists, engineers, and air quality managers from universities, federal and state governments, industry, and public interest groups. In SOS, these groups work to design and execute scientific research and assessment programs that will increase understanding of the accumulation of ozone, other oxidants, and fine particulate matter in the atmosphere near the ground. The SOS program began in 1988 and will continue at least through the year 2002. Website: "http://www2.ncsu.edu/ncsu/CIL/southern_oxidants/index.html"
type: Concept

CONSORTIA/INSTITUTIONS
type: Concept