ACADEMIC
type: Concept

U-TROMSO/NCFS
in scheme: providers
definition: The Norwegian College of Fishery Science (NCFS), situated at 70 degrees north and close to The Barents Sea, has a particular responsibility for the development of fundamental and scientific expertise within all areas of fisheries and aquaculture research in Norway. NCFS is also responsible for educating candidates for employment in the fishing industry and fisheries management. The College offers a number of BSc, MSc, and PhD programmes. All the teaching in "International Fisheries Management", a two-year master programme, is done in English. Summary Provided By: http://www.nfh.uit.no/arctos/insitutes/incfs.html
type: Concept