Earth Observation Satellites
type: Concept

PlanetScope
change note: 2021-11-18 13:01:06.0 [tstevens] Move Concepts delete broader relation (null); add broader relation (PlanetScope [6fffd5bf-1d22-487a-8b4c-495992ef3b28,826363] - Earth Observation Satellites [3466eed1-2fbb-49bf-ab0b-dc08731d502b,826121]);
change note: 2020-10-07 11:19:23.0 [mmorahan] insert AltLabel (id: null category: primary text: PlanetScope language code: en);
change note: 2019-05-02 12:06:31.0 [mmorahan] insert Definition (id: null text: The PlanetScope satellite constellation consists of multiple launches of groups of individual satellites (DOVEs). Therefore, on-orbit capacity is constantly improving in capability or quantity, with technology improvements deployed at a rapid pace. Each DOVE satellite is a CubeSat 3U form factor (10 cm by 10 cm by 30 cm). The complete PlanetScope constellation of approximately 150 active satellites is able to image the entire land surface of the Earth every day (equating to a daily collection capacity of 350 million km²/day). The constellation is constantly "on" and does not require ordering or acquisition planning. language code: en);
change note: 2019-05-06 07:33:25.0 [mmorahan] insert WeightedRelation (id: null related concept uuid: ccae4c79-b985-4be6-b146-5c1a1a395e03 relationship type: null relationship value: null generated by: null);
change note: 2019-05-02 12:04:56.0 [mmorahan] Insert Concept add broader relation (PlanetScope [6fffd5bf-1d22-487a-8b4c-495992ef3b28,368749] - Earth Observation Satellites [3466eed1-2fbb-49bf-ab0b-dc08731d502b,344761]);
change note: 2021-11-18 12:44:51.0 [tstevens] Move Concepts delete broader relation (null); add broader relation (PlanetScope [6fffd5bf-1d22-487a-8b4c-495992ef3b28,826363] - Space-based Platforms [b39a69b4-c3b9-4a94-b296-bbbbe5e4c847,835875]);
type: Concept
in scheme: platforms
definition: The PlanetScope satellite constellation consists of multiple launches of groups of individual satellites (DOVEs). Therefore, on-orbit capacity is constantly improving in capability or quantity, with technology improvements deployed at a rapid pace. Each DOVE satellite is a CubeSat 3U form factor (10 cm by 10 cm by 30 cm). The complete PlanetScope constellation of approximately 150 active satellites is able to image the entire land surface of the Earth every day (equating to a daily collection capacity of 350 million km²/day). The constellation is constantly "on" and does not require ordering or acquisition planning.