Jet
type: Concept

NASA WB-57F
change note: 2022-02-20 12:14:01.0 [tstevens] update Definition (The NASA Johnson Space Center (JSC) in Houston, Texas is the home of the NASA WB-57 High Altitude Research Program. Two fully operational WB-57 aircraft are based near JSC at Ellington Field. Both aircraft have been flying research missions since the early 1960's, and continue to be an asset to the scientific community with professional, reliable, customer-oriented service designed to meet all scientific objectives.); update Definition (NASA);
change note: 2021-11-17 13:32:42.0 [tstevens] Move Concepts delete broader relation (null); add broader relation (NASA WB-57F [701c4a38-b7f2-41de-ab5f-d1c8ad76a717,826364] - Jet [5b8e4067-db4e-42d4-b4a5-7de5e683125d,835881]);
change note: 2019-06-26 16:11:52.0 [sritz] update Definition (The NASA Johnson Space Center (JSC) in Houston, Texas is the home of the NASA WB-57 High Altitude Research Program. Two fully operational WB-57 aircraft are based near JSC at Ellington Field. Both aircraft have been flying research missions since the early 1960's, and continue to be an asset to the scientific community with professional, reliable, customer-oriented service designed to meet all scientific objectives. [Text and Photo provided by: https://jsc-aircraft-ops.jsc.nasa.gov/wb-57.html ] Group: Platform_Details Entry_ID: NASA WB-57F Group: Platform_Identification Platform_Category: Aircraft Short_Name: NASA WB-57F End_Group Group: Platform_Associated_Instruments Short_Name: ACATS Short_Name: HIRAD End_Group Creation_Date: 2008-07-14 Online_Resource: https://jsc-aircraft-ops.jsc.nasa.gov/wb-57.html End_Group); delete Resource (null);
in scheme: platforms
definition: The NASA Johnson Space Center (JSC) in Houston, Texas is the home of the NASA WB-57 High Altitude Research Program. Two fully operational WB-57 aircraft are based near JSC at Ellington Field. Both aircraft have been flying research missions since the early 1960's, and continue to be an asset to the scientific community with professional, reliable, customer-oriented service designed to meet all scientific objectives.
type: Concept