AVISO
change note: 2013-06-02 20:41:10.0 [sgrebas] added project description update Definition (The AVISO (Archiving, Validation and Interpretation of Satellite Oceanographic data) program seeks to provide long-term, continuous altimetry datasets by merging past and present satellite altimetry missions. Aviso distributes satellite altimetry data from Topex/Poseidon, Jason-1, ERS-1 and ERS-2, and EnviSat, and Doris precise orbit determination and positioning products.);
change note: 2013-05-16 09:14:32.0 [mpmorahan] insert AltLabel (id: null text: Archiving, Validation and Interpretation of Satellite Oceanographic Data language code: en);
change note: 2013-05-16 09:05:51.0 [mpmorahan] Insert Concept add broader relation (AVISO [702ab0e0-3f0e-4782-890a-026c15486526,105129] - A - C [0c89f3f4-7ab1-43ce-89ee-795d35f0e30a,77505]);
in scheme: projects
definition: The AVISO (Archiving, Validation and Interpretation of Satellite Oceanographic data) program seeks to provide long-term, continuous altimetry datasets by merging past and present satellite altimetry missions. Aviso distributes satellite altimetry data from Topex/Poseidon, Jason-1, ERS-1 and ERS-2, and EnviSat, and Doris precise orbit determination and positioning products.
type: Concept

A - C
type: Concept