UMICH/LSA/GEOL
in scheme: providers
definition: The College of Literature, Science, and the Arts (LSA) is the heart of the University of Michigan, an extraordinary center of creativity, inquiry, and discovery. Combining the best of a research institution and a liberal arts college, students and faculty in more than 70 departments and programs explore the world's big questions together. Summary provided by http://www.lsa.umich.edu/lsa
type: Concept

ACADEMIC
type: Concept