Recorders/Loggers
type: Concept

ALTUS DATA COLLECTION SYSTEM
in scheme: instruments
definition: A system used to collect data and events, such as flight and vehicle parameters from the Altus Unmanned Aerial Vehicle (UAV). Group: Instrument_Details Entry_ID: ALTUS DATA COLLECTION SYSTEM Group: Instrument_Identification Instrument_Category: In Situ/Laboratory Instruments Instrument_Class: Recorders/Loggers Short_Name: ALTUS DATA COLLECTION SYSTEM End_Group Group: Instrument_Associated_Sensors Short_Name: ALTUS DATA COLLECTION SYSTEM End_Group Group: Associated_Platforms Short_Name: ALTUS End_Group Sample_Image: http://geo.arc.nasa.gov/sge/UAVFiRE/images/fig6.gif Creation_Date: 2008-03-18 End_Group
type: Concept