OCEANIC NINO INDEX
change note: 2020-02-14 13:09:17.0 [tstevens] Remove Concepts delete narrower relation (null);
change note: 2012-06-25 13:21:29.0 [mpmorahan] Insert Concept add narrower relation (OCEANIC NINO INDEX [70ed535b-a591-411d-80ca-9eafe10b3be8,23025] - ONI [fbae11f2-f8db-44b8-bcb6-55471dca13a2,39763]);
change note: 2012-06-25 12:09:13.0 [mpmorahan] Move Concepts delete broader relation (null); add broader relation (OCEANIC NINO INDEX [70ed535b-a591-411d-80ca-9eafe10b3be8,23025] - SEA SURFACE TEMPERATURE INDICES [b83895e9-bac8-49fe-bcf5-8fe4d8fcaa16,39747]);
in scheme: sciencekeywords
definition: Beginning in December 2008, the Oceanic Nino Index (ONI) is calculated using Version 3b of the extended reconstructed sea surface temperature (ERSST) dataset. More information on this new dataset is provided here (see refefrence link). This new monthly analysis replaces ERSST Version 3, which will no longer be updated. In the meantime, we are temporarily providing web links to the ONI based on ERSST.v3b and ERSST.v3.
type: Concept

SEA SURFACE TEMPERATURE INDICES
type: Concept