ICESat
type: Concept
change note: 2018-04-24 16:39:09.0 [sritz] update Definition ([Source: NASA ICESat home page] ICESat (Ice, Cloud,and land Elevation Satellite) is the benchmark Earth Observing System mission for measuring ice sheet mass balance, cloud and aerosol heights, as well as land topography and vegetation characteristics. From 2003 to 2009, the ICESat mission provided multi-year elevation data needed to determine ice sheet mass balance as well as cloud property information, especially for stratospheric clouds common over polar areas. It also provided topography and vegetation data around the globe, in addition to the polar-specific coverage over the Greenland and Antarctic ice sheets. Group: Platform_Details Entry_ID: ICESAT Group: Platform_Identification Platform_Category: Earth Observation Satellites Short_Name: ICESAT Long_Name: Ice, Cloud and Land Elevation Satellite End_Group Group: Synonymous_Platform_Names Short_Name: ICESAT End_Group Group: Platform_Associated_Instruments Short_Name: GLAS End_Group Group: Orbit Orbit_Altitude: ~600 km Orbit_Inclination: 94 degrees Period: ~97 minutes Repeat_Cycle: 91 days with ~33 days subcycle Perigee: 593 km (368 mi) Apogee: 610 km (379 mi) Orbit_Type: LEO > Low Earth Orbit > Polar Non-Sun-Synchronous End_Group Creation_Date: 2007-04-16 Online_Resource: https://icesat.gsfc.nasa.gov/ Online_Resource: http://www.csr.utexas.edu/glas/atbd.html Group: Platform_Logistics Launch_Date: 2003-01-12 Launch_Site: Vandenberg Air Force Base, USA Design_Life: 3 years Primary_Sponsor: USA/NASA End_Group End_Group); delete Resource (null);
change note: 2016-06-09 14:43:38.0 [epneff] added altLabel insert AltLabel (id: null text: ICESAT-1 language code: en);
change note: 2021-12-02 09:10:28.0 [tstevens] Move Concepts delete broader relation (null); add broader relation (ICESat [71536bf5-2d19-4c63-a127-95264da38082,826367] - Ice, Cloud and Land Elevation Satellite (ICESat) [3eb57645-3c25-4718-a255-21c8d19d0517,835939]);
change note: 2018-04-24 16:34:29.0 [sritz] update PrefLabel (ICESat); update Resource (image);
alternative label: ICESAT-1
in scheme: platforms
definition: [Source: NASA ICESat home page] ICESat (Ice, Cloud,and land Elevation Satellite) is the benchmark Earth Observing System mission for measuring ice sheet mass balance, cloud and aerosol heights, as well as land topography and vegetation characteristics. From 2003 to 2009, the ICESat mission provided multi-year elevation data needed to determine ice sheet mass balance as well as cloud property information, especially for stratospheric clouds common over polar areas. It also provided topography and vegetation data around the globe, in addition to the polar-specific coverage over the Greenland and Antarctic ice sheets. Group: Platform_Details Entry_ID: ICESAT Group: Platform_Identification Platform_Category: Earth Observation Satellites Short_Name: ICESAT Long_Name: Ice, Cloud and Land Elevation Satellite End_Group Group: Synonymous_Platform_Names Short_Name: ICESAT End_Group Group: Platform_Associated_Instruments Short_Name: GLAS End_Group Group: Orbit Orbit_Altitude: ~600 km Orbit_Inclination: 94 degrees Period: ~97 minutes Repeat_Cycle: 91 days with ~33 days subcycle Perigee: 593 km (368 mi) Apogee: 610 km (379 mi) Orbit_Type: LEO > Low Earth Orbit > Polar Non-Sun-Synchronous End_Group Creation_Date: 2007-04-16 Online_Resource: https://icesat.gsfc.nasa.gov/ Online_Resource: http://www.csr.utexas.edu/glas/atbd.html Group: Platform_Logistics Launch_Date: 2003-01-12 Launch_Site: Vandenberg Air Force Base, USA Design_Life: 3 years Primary_Sponsor: USA/NASA End_Group End_Group

Ice, Cloud and Land Elevation Satellite (ICESat)
type: Concept