U-OSLO/ITA
in scheme: providers
definition: The Institute of Theoretical Astrophysics activities include both theoretical astrophysics and observational astronomy from ground and space. Staff members are involved in several instruments on the ESA/NASA Solar and Heliospheric Observatory (SOHO), in particular the Coronal Diagnostic Spectrometer. Other activities include ground based observations from the Swedish Station at La Palma, involvement in LEST. Website: "http://www.astro.uio.no/paalb/" [Summary provided by the University of Oslo.]
type: Concept

ACADEMIC
type: Concept