DRAINAGE AMOUNT
change note: 2016-04-04 09:14:42.0 [gee-cee] update Definition (The amount of water being drained from a specified area.);
change note: 2016-03-31 09:20:44.0 [gee-cee] insert Definition (id: null text: The amount of water being drained from a specified area language code: en);
change note: 2016-03-31 09:20:18.0 [gee-cee] Insert Concept add broader relation (DRAINAGE AMOUNT [71926eb5-b64c-42d9-be6a-26f7b2a5fbf1,158743] - DRAINAGE [269c7277-fa8f-4c1c-bd8b-ab772c1df4e5,83903]);
in scheme: sciencekeywords
definition: The amount of water being drained from a specified area.
type: Concept

DRAINAGE
type: Concept