FLUVIAL LANDFORMS
type: Concept

PINGO
change note: 2013-08-15 12:57:43.0 [tbs1979] insert Definition (id: null text: Also called a hydrolaccolith, is a mound of earth-covered ice found in the Arctic and subarctic that can reach up to 70 metres (230 ft) in height and up to 600 m (2,000 ft) in diameter. language code: en);
change note: 2013-08-05 12:37:00.0 [tbs1979] Insert Concept add broader relation (PINGO [71b4e773-40a4-47db-8449-7c13f4cc49d9,105325] - FLUVIAL LANDFORMS [bdc0bd86-a3a3-48fa-b1fb-4ca5d13d4dde,105281]);
in scheme: sciencekeywords
definition: Also called a hydrolaccolith, is a mound of earth-covered ice found in the Arctic and subarctic that can reach up to 70 metres (230 ft) in height and up to 600 m (2,000 ft) in diameter.
type: Concept