DATA PROCESSING SERVICES
type: Concept

COVERAGE PORTRAYAL SERVICE
in scheme: sciencekeywords
definition: Dynamically produces client-specified pictorial renderings in an image or graphics format of a coverage subset dynamically retrieved from a Web Coverage Service (WCS).
type: Concept