TOTAL PRESSURE
in scheme: sciencekeywords
definition: The sum of the static pressure and the dynamic pressure when these concepts are applicable. (Also called Stagnation Pressure)
type: Concept

SENSOR CHARACTERISTICS
type: Concept