FPS
in scheme: providers
definition: The principals at Fire Solutions have an extensive reservoir of knowledge, skills and abilities in wildland and structural fire protection. Our years of practical fire suppression experience and training has helped us design fire equipment that is well suited to the requirements of modern fire fighting. Our principal designers have an extensive history of fire design work. They understand the true needs that our customers require for quality and reliability. We have many years of experienced and formalized training in fire prevention, fire suppression and prescribed fire. Summary provided by http://firefighting.blogs.com/fire_fighting_equipment/
type: Concept

COMMERCIAL
type: Concept