CALTECH/GPS/TECTONICS
in scheme: providers
definition: Analytical facilities in the GPS division are available to the campus on a fee basis. Both instrument time and operator services are available. Analytical services are provided to other colleges and universities, and under certain conditions, off campus analytical work is accepted from corporations, government labs, non-profit organizations, and individuals. Summary Provided by: http://www.gps.caltech.edu/facilities
type: Concept

ACADEMIC
type: Concept