CONSORTIA/INSTITUTIONS
type: Concept

IRD
change note: 2014-04-08 14:01:08.0 [128.183.164.42] Remove Concepts delete narrower relation (null);
change note: 2014-04-08 14:00:49.0 [128.183.164.42] Move Concepts add narrower relation (IRD [73b71d04-fb55-4ce9-bc0f-0b0080fe4afb,69007] - NFHP [e9a2f905-b0bc-4352-b7a2-af0afd49a037,106275]);
in scheme: providers
definition: Its mission is to develop scientific projects focusing on the relationship between man and his environment in the Indian Ocean region. Summary Provided by: http://translate.google.com/translate?hl=en&sl=fr&u=http://www.ird.fr/&sa=X&oi=translate&resnum=2&ct=result&prev=/search%3Fq%3D%2BL%2527%2BInstitut%2Bde%2BRecherche%2Bpour%2Ble%2BDeveloppement%26hl%3Den%26safe%3Doff%26client%3Dfirefox-a%26rls%3Dorg.mozilla:en-US:official%26hs%3DtIC%26sa%3DG
type: Concept