OCEAN PLATEAUS/RIDGES
in scheme: sciencekeywords
definition: Geological features pertaining to the large, flat rises or ridges. A ridge is a long, narrow elevation of the sea floor, with steep sides and irregular topography. Ocean plateaus refer to an area of highland, usually consisting of relatively flat rises, and are formed when land has been uplifted and then eroded by wind or water.
type: Concept

BATHYMETRY/SEAFLOOR TOPOGRAPHY
type: Concept