GNDT-SN1
change note: 2013-02-21 15:39:56.0 [aaleman] Insert Concept add broader relation (GNDT-SN1 [744fd1cb-506d-4b83-a480-da69720928eb,82679] - G - I [af0968ce-ffe3-44a0-86de-2ec9b9a8fa5d,77509]);
in scheme: projects
definition: Design and development of a seismic monitoring and alarm underwater network in areas highly exposed to seismic risk - Development of a first node in Eastern Sicily (SN-1) http://roma2.rm.ingv.it/en/projects/national/10/GNDT-SN1
type: Concept

G - I
type: Concept