ACADEMIC
type: Concept

CWRU/GEOLOGY
in scheme: providers
definition: The Department of Geological Sciences at Case encompasses a wide range of teaching and learning opportunities into the physical, chemical, and biological processes that shape the earth and the planets. Earth science provides a lens for understanding properties of the earth's interior, surface, and ecology. Summary Provided By: http://geology.cwru.edu/about.html
type: Concept