M - O
type: Concept

MISR Research Aerosol Algorithm
change note: 2022-06-27 14:27:53.0 [tstevens] insert AltLabel (id: null category: primary text: Multi-angle Imaging SpectroRadiometer Research Aerosol Algorithm language code: en); insert Definition (id: null text: The MISR Research Aerosol Retrieval Algorithm (RA) validation dataset is a data product that will allow others to reproduce the results found in Limbacher and Kahn (2019) and Limbacher et al. (2022; submitted). Additionally, this data product would potentially allow others to develop improvements to our cloud mask and quality assessment. language code: en);
change note: 2022-06-27 14:24:52.0 [tstevens] Insert Concept add broader relation (MISR Research Aerosol Algorithm [75f45ee3-4de0-4f79-b2b7-30ed2ca3e788,967435] - M - O [a31c2828-9b6d-44e9-b6ad-7ae81030f322,961468]);
in scheme: projects
definition: The MISR Research Aerosol Retrieval Algorithm (RA) validation dataset is a data product that will allow others to reproduce the results found in Limbacher and Kahn (2019) and Limbacher et al. (2022; submitted). Additionally, this data product would potentially allow others to develop improvements to our cloud mask and quality assessment.
type: Concept