MEXICO
type: Concept

MX/CONABIO
in scheme: providers
definition: CONABIO has the objective of approving projects and studies on the knowledge and use of biodiversity, give assistance to government and other sectors, conduct special projects, disseminate knowledge on biological richness, give continuity to international collaborative agreements and do public services. Summary provided by http://www.gulfbase.org/organization/view.php?oid=conabio
type: Concept