USDA
type: Concept

USDA/ARS/NAL/WQIC
in scheme: providers
definition: The USDA Water Quality Information Center provides electronic access to information about water, agricultural, wetlands, and the environment. From this site, users can access water-related databases. Website "http://www.nal.usda.gov/wqic/"
type: Concept