GCPEx
change note: 2017-08-10 15:28:31.0 [sritz] insert AltLabel (id: null category: primary text: GPM Cold Season Precipitation Experiment language code: en); insert Definition (id: null text: The GPM Cold-season Precipitation Experiment (GCPEx) field campaign occurred in Ontario, Canada during the winter season (Jan 15- Feb 26) of 2011-2012. GCPEx addressed shortcomings in GPM snowfall retrieval algorithm by collecting microphysical properties, associated remote sensing observations, and coordinated model simulations of precipitating snow. The overarching goal of GCPEx was to characterize the ability of multi-frequency active and passive microwave sensors to detect and estimate falling snow. language code: en);
change note: 2017-08-10 15:27:04.0 [sritz] Insert Concept add broader relation (GCPEx [763d7d18-450d-459f-bfc9-2b791e35c678,309871] - G - I [af0968ce-ffe3-44a0-86de-2ec9b9a8fa5d,294133]);
in scheme: projects
definition: The GPM Cold-season Precipitation Experiment (GCPEx) field campaign occurred in Ontario, Canada during the winter season (Jan 15- Feb 26) of 2011-2012. GCPEx addressed shortcomings in GPM snowfall retrieval algorithm by collecting microphysical properties, associated remote sensing observations, and coordinated model simulations of precipitating snow. The overarching goal of GCPEx was to characterize the ability of multi-frequency active and passive microwave sensors to detect and estimate falling snow.
type: Concept

G - I
type: Concept