MT-STATE/MWC
change note: 2014-04-11 09:46:59.0 [128.183.164.42] created data center insert AltLabel (id: null text: Montana Water Center, Montana State University language code: en); insert Definition (id: null text: Established in 1964 by an act of Congress, the Montana Water Center advances water research, information, education, and problem-solving partnerships throughout the state of Montana and beyond. It is one of 54 Centers in the nation collectively known as the Water Resources Research Institutes. language code: en);
change note: 2014-04-11 09:43:48.0 [128.183.164.42] Insert Concept add broader relation (MT-STATE/MWC [769fdf92-9850-4a67-8949-a9244746a8ea,106303] - ACADEMIC [7700280b-68ee-4644-bf5e-84e7a6adf897,66467]);
in scheme: providers
definition: Established in 1964 by an act of Congress, the Montana Water Center advances water research, information, education, and problem-solving partnerships throughout the state of Montana and beyond. It is one of 54 Centers in the nation collectively known as the Water Resources Research Institutes.
type: Concept

ACADEMIC
type: Concept