AS355-F2
definition: A twin-engine light utility helicopter developed and originally manufactured by Aérospatiale in France. The Écureuil 2 was directly derived from the single-engined AS350 Écureuil, performing its maiden flight on 28 September 1979 and introduced to service shortly thereafter. The type was commonly marketed in North America as the TwinStar. During the 1990s, Aérospatiale merged its helicopter interests into the multinational Eurocopter consortium; under this new entity, the Écureuil 2 continued to be manufactured. Shortly after Eurocopter's rebranding as Airbus Helicopters, the group decided to discontinue production of the Écureuil 2 during 2016, however, production of its single-engined siblings has continued since then.
change note: 2018-01-05 14:55:16.0 [sritz] Insert Concept add broader relation (AS355-F2 [770c3b12-d083-4df9-8b36-27a4786794bb,310519] - Aircraft [227d9c3d-f631-402d-84ed-b8c5a562fc27,287509]);
change note: 2022-02-17 15:28:37.0 [tstevens] insert Definition (id: null text: A twin-engine light utility helicopter developed and originally manufactured by Aérospatiale in France. The Écureuil 2 was directly derived from the single-engined AS350 Écureuil, performing its maiden flight on 28 September 1979 and introduced to service shortly thereafter. The type was commonly marketed in North America as the TwinStar. During the 1990s, Aérospatiale merged its helicopter interests into the multinational Eurocopter consortium; under this new entity, the Écureuil 2 continued to be manufactured. Shortly after Eurocopter's rebranding as Airbus Helicopters, the group decided to discontinue production of the Écureuil 2 during 2016, however, production of its single-engined siblings has continued since then. language code: en);
change note: 2018-01-05 14:57:55.0 [sritz] Requested by NSIDC DAAC. insert AltLabel (id: null category: primary text: Helicopter AS355-F2 language code: en);
change note: 2021-11-17 13:26:19.0 [tstevens] Move Concepts delete broader relation (null); add broader relation (AS355-F2 [770c3b12-d083-4df9-8b36-27a4786794bb,826392] - Rotorcraft/Helicopter [610cd524-ed33-44c2-811c-66bd27b9b3ea,835883]);
in scheme: platforms
type: Concept

Rotorcraft/Helicopter
type: Concept