USC/GEOG
in scheme: providers
definition: The Department of Geography at the University of South Carolina (26,000 students), is the only program in the state to offer Bachelors, Masters' and Ph.D. degrees in Geography. The 19 full-time faculty members represent three broad areas of expertise within the discipline (human/ regional; physical/ environmental; and the geographic techniques). We also participate in interdisciplinary programs — International Studies, Southern Studies, Women's Studies, and the School of the Environment — in the college and university. Summary provided by: http://www.cas.sc.edu/geog/
type: Concept

ACADEMIC
type: Concept