TOTAL TOTALS INDEX (TT)
change note: 2017-07-14 15:59:58.0 [sritz] Insert Concept add broader relation (TOTAL TOTALS INDEX (TT) [77bcf3f2-8d61-4b18-9e2a-439310197c83,309805] - Stability/Severe Weather Indices [7844ae66-f542-442f-8359-05014bc19831,309797]);
in scheme: sciencekeywords
definition: Total Totals Index = Index in units of degrees Celsius (°C) is indicative of severe weather potential.
type: Concept

Stability/Severe Weather Indices
type: Concept