ELECTRICAL CONDUCTIVITY
change note: 2017-03-10 09:05:08.0 [tstevens] update Definition (A measure of ease with which a conduction current can be caused to flow through a soil under the influence of an applied electric field.); update Definition (Adapted from Jackson, J.A. (1997) Glossary of Geology. 4th ed. Alexandria VA:American Geological Institute. 769 p.);
in scheme: sciencekeywords
definition: A measure of ease with which a conduction current can be caused to flow through a soil under the influence of an applied electric field.
type: Concept

SOILS
type: Concept