M - O
type: Concept

MERRA-2 Ocean
change note: 2022-05-25 16:45:00.0 [sritz] insert AltLabel (id: null category: primary text: Modern-Era Retrospective Reanalysis Ocean – The GEOS-S2S-3 Weakly Coupled Reanalysis language code: en);
change note: 2022-05-25 16:47:14.0 [sritz] insert Definition (id: null text: “MERRA-2 Ocean”, NASA/GMAO’s weakly (one-way) coupled atmosphere-land-ocean reanalysis will cover the period 1982-present and is due for public release late 2020 language code: en);
change note: 2022-05-25 16:44:00.0 [sritz] Insert Concept add broader relation (MERRA-2 Ocean [786f0e12-ac27-44e6-a881-fb1c5c69d28a,938201] - M - O [a31c2828-9b6d-44e9-b6ad-7ae81030f322,932238]);
type: Concept
definition: “MERRA-2 Ocean”, NASA/GMAO’s weakly (one-way) coupled atmosphere-land-ocean reanalysis will cover the period 1982-present and is due for public release late 2020
in scheme: projects