M - O
type: Concept

NSF/PLR
change note: 2014-09-11 10:20:23.0 [aaleman] updated definition update Definition (The Division of Polar Programs (POLAR) manages and initiates National Science Foundation funding for basic research and its operational support in the Arctic and the Antarctic. The funds are provided as NSF grants to institutions (mainly U.S. universities), whose scientists perform the research at the institutions or in a polar region, and as cooperative agreements or contracts to support organizations including contractors and the U.S. military. POLAR supports individual investigators or research teams and U.S. participation in multinational projects. Projects can involve investigators from many disciplines and institutions over several years. Organizationally, POLAR has two science sections- one for the Arctic and the Antarctic. A third section manages the logistics and support operations including field stations, camps, laboratories, ships, and airplanes. Environmental, health and safety issues are handled by the Polar Environment, Health and Safety Section. Information provided by http://www.nsf.gov/div/index.jsp?div=PLR);
change note: 2014-09-11 10:18:47.0 [aaleman] updated due to change in nsf naming convention update AltLabel (Division of Polar Programs, National Science Foundation); update PrefLabel (NSF/PLR);
in scheme: projects
definition: The Division of Polar Programs (POLAR) manages and initiates National Science Foundation funding for basic research and its operational support in the Arctic and the Antarctic. The funds are provided as NSF grants to institutions (mainly U.S. universities), whose scientists perform the research at the institutions or in a polar region, and as cooperative agreements or contracts to support organizations including contractors and the U.S. military. POLAR supports individual investigators or research teams and U.S. participation in multinational projects. Projects can involve investigators from many disciplines and institutions over several years. Organizationally, POLAR has two science sections- one for the Arctic and the Antarctic. A third section manages the logistics and support operations including field stations, camps, laboratories, ships, and airplanes. Environmental, health and safety issues are handled by the Polar Environment, Health and Safety Section. http://www.nsf.gov/geo/plr/about.jsp
type: Concept