SENSOR CHARACTERISTICS
type: Concept

GEOLOCATION
change note: 2017-04-25 17:00:11.0 [aaleman] Insert Concept add broader relation (GEOLOCATION [7a0ab5f9-2317-4217-a081-8d4a46eb5334,309553] - SENSOR CHARACTERISTICS [8799f524-e313-4d2d-9428-8d672d123513,83753]);
in scheme: sciencekeywords
definition: Sensor location at Earth's surface. (definition provided by NSIDC)
type: Concept