TOTAL DISSOLVED SOLIDS
change note: 2018-03-07 09:10:10.0 [tstevens] update Definition (Materials less than 0.45 micrometer in length, as distinguished from suspended solids and other particulate matter, which are greater than 0.45 micrometer in length.); update Definition (Adapted from: Dictionary of Earth Science, 5th ed.. 1997. Sybil Parker, ed. in chief. McGraw-Hill. );
change note: 2018-03-07 08:36:09.0 [tstevens] update PrefLabel (TOTAL DISSOLVED SOLIDS);
change note: 2018-03-07 08:08:51.0 [tstevens] Move Concepts delete broader relation (null); add broader relation (DISSOLVED SOLIDS [7d82a1f7-aa6e-47c7-8eb3-78bfe2e4349b,86683] - SOLIDS [fad79bec-0672-4c71-8910-174c8985a1b9,310631]);
in scheme: sciencekeywords
definition: Materials less than 0.45 micrometer in length, as distinguished from suspended solids and other particulate matter, which are greater than 0.45 micrometer in length.
type: Concept

SOLIDS
type: Concept