BJ-1 MSI
in scheme: instruments
definition: Beijing-1 Multispectral Imager is a high-resolution earth observation remote sensors, orbit altitude of 686 km, the resolution of the sensors is 32 meters with a 600 km swath.The data can be used for land use, geological survey, survey of water resources, floods, winter wheat acreage monitoring, forest type identification, urban planning, monitoring and archaeological aspects of applied research. Group: Instrument_Details Entry_ID: BJ-1 MSI Group: Instrument_Identification Instrument_Category: Earth Remote Sensing Instruments Instrument_Class: Passive Remote Sensing Instrument_Type: Spectrometers/Radiometers Instrument_Subtype: Imaging Spectrometers/Radiometers Short_Name: BJ-1 MSI Long_Name: BJ-1 Multispectral Imager End_Group Group: Associated_Platforms Short_Name: BEIJING-1 End_Group Group: Spectral_Frequency_Information Wavelength_Keyword: VISIBLE Spectral_Frequency_Coverage_Range: Green 520 - 600 nm End_Group Group: Spectral_Frequency_Information Wavelength_Keyword: VISIBLE Spectral_Frequency_Coverage_Range: Red 630 - 690 nm End_Group Group: Spectral_Frequency_Information Wavelength_Keyword: NEAR INFRARED Spectral_Frequency_Coverage_Range: NIR 760 - 900 nm End_Group Online_Resource: http://www.blmit.com.cn/document/weixingjieshao.jsp Creation_Date: 2011-08-31 Group: Instrument_Logistics Instrument_Start_Date: 2005-10-27 Instrument_Owner: NRSCC End_Group End_Group
type: Concept

Imaging Spectrometers/Radiometers
type: Concept