SINKHOLES (DOLINES)
change note: 2013-04-01 13:40:27.0 [tbs1979] insert Definition (id: null text: A pit like hole found in areas of karst. These features are caused by the weathering of limestone or dolomite by subsurface drainage. language code: en);
change note: 2013-03-05 09:34:33.0 [tbs1979] Insert Concept add broader relation (SINKHOLES (DOLINES) [7f298307-73f6-4f10-96a2-db381f357cb6,82871] - KARST LANDFORMS [ac2d1035-1896-42c1-861b-042a917b6889,62827]);
in scheme: sciencekeywords
definition: A pit like hole found in areas of karst. These features are caused by the weathering of limestone or dolomite by subsurface drainage.
type: Concept

KARST LANDFORMS
type: Concept