LOBP
in scheme: providers
definition: [Source: Le Centre d’Océanologie de Marseille, http://www.com.univ-mrs.fr/ ] The Centre of Oceanology of Marseille is an internal school of the University of the Mediterranean Observatory of Sciences of the Universe from the National Institute of Sciences of the Universe CNRS.
type: Concept

ACADEMIC
type: Concept