CORAL REEFS
type: Concept

RIBBON REEF
change note: 2013-08-20 08:48:28.0 [tbs1979] insert Definition (id: null text: A long, narrow, somewhat winding reef, usually associated with an atoll lagoon. language code: en);
change note: 2013-08-06 08:10:40.0 [tbs1979] Insert Concept add broader relation (RIBBON REEF [7f674559-6e36-4a13-ac0c-f61aa6a37d63,105499] - CORAL REEFS [c6244bfb-300f-4818-bf45-cf1a15e7e073,105487]);
in scheme: sciencekeywords
definition: A long, narrow, somewhat winding reef, usually associated with an atoll lagoon.
type: Concept