NON-GOVERNMENT/NON-PROFIT ORGANIZATIONS
type: Concept

BTFS
in scheme: providers
definition: Belize Tropical Forest Studies is a Non-Governmental Organisation, registered in Belize in 1997. The mission of Belize Tropical Forest Studies (BTFS) is to collect and disseminate biodiversity information in and about Belize. BTFS's activities are mainly oriented towards biodiversity assessments of protected areas and private lands. BTFS is involved with some regional projects (e.g., MesoAmerican Biological Corridors Project, Selva Maya Ecoregional Assessment Project) and technical partnerships (e.g., Programme for Belize, Forestry Department, TransNatura LLC). Summary Provided By: http://www.green-hills.net/btfs/index.htm
type: Concept