PSB.SD
change note: 2021-04-22 15:25:56.0 [tstevens] insert AltLabel (id: null category: primary text: SuperDove language code: en); insert Definition (id: null text: The new PSB.SD instrument is comprised of the next-generation "PSBlue" telescope with a larger 47 megapixel sensor and the same filter response as PS2.SD above, in the Red, Green, Blue and NIR bands. The PSB.SD payloads extend on this capability so that in addition to the four bands that are identical to the PS2.SD spectral bands above (Red, Green II, Blue and NIR), there is also an additional band. Specifically, Red Edge, which is meant to be interoperable with Sentinel-2 band 5. language code: en);
change note: 2021-04-22 15:24:13.0 [tstevens] Insert Concept add broader relation (PSB.SD [80b5c374-728b-4ae3-b3e9-f86cc70475e0,578420] - Telescopes [7502f18e-f489-49f5-b879-27d5407df7ec,567147]);
in scheme: instruments
definition: The new PSB.SD instrument is comprised of the next-generation "PSBlue" telescope with a larger 47 megapixel sensor and the same filter response as PS2.SD above, in the Red, Green, Blue and NIR bands. The PSB.SD payloads extend on this capability so that in addition to the four bands that are identical to the PS2.SD spectral bands above (Red, Green II, Blue and NIR), there is also an additional band. Specifically, Red Edge, which is meant to be interoperable with Sentinel-2 band 5.
type: Concept

Telescopes
type: Concept