D - F
type: Concept

FRLAB
in scheme: projects
definition: FRLAB (Front Range Lidar and Ballon Experiment 3) was an experiment conducted along the front range of the Rockies in Colorado and Wyoming to measure concentrations of black carbon in the amosphere.
type: Concept