NEAR-INFRARED SPECTROMETER
change note: 2021-08-05 16:08:14.0 [sritz] insert AltLabel (id: null category: primary text: NEAR-INFRARED SPECTROMETER language code: en);
in scheme: instruments
definition: A NEAR INFRARED SPECTROMETER is a spectroscope that is close to the infrared part or red end of the electromagnetic spectrum. Group: Instrument_Details Entry_ID: NEAR-INFRARED SPECTROMETER Group: Instrument_Identification Instrument_Category: Earth Remote Sensing Instruments Instrument_Class: Passive Remote Sensing Instrument_Type: Spectrometers/Radiometers Instrument_Subtype: Spectrometers Short_Name: NEAR-INFRARED SPECTROMETER End_Group Group: Associated_Platforms Short_Name: OCO End_Group End_Group
type: Concept

Spectrometers
type: Concept